BDBM50253658 2-[4-[2-Amino-3-(4-fluoro-phenyl)-propionyl]-3-(2-dimethylaminoethyl)-2-oxo-piperazin-1-yl]-N-methyl-3-naphthalen-2-yl-propionamide::CHEMBL468252
SMILES CNC(=O)[C@H](Cc1ccc2ccccc2c1)N1CCN([C@@H](CCN(C)C)C1=O)C(=O)[C@H](N)Cc1ccc(F)cc1
InChI Key InChIKey=XHTANTIBUJVBIZ-PKTNWEFCSA-N
Data  3 KI  1 EC50
  Tab Delimited (TSV)   2D SDfile   Computed 3D by Vconf -m prep SDfile
Find this compound or compounds like it in BindingDB:
Activity Spreadsheet -- Enzyme Inhibition Constant Data from BindingDB
Found 2 hits for monomerid = 50253658
TargetMelanocortin receptor 4(Homo sapiens (Human))
Procter & Gamble Pharmaceuticals
Curated by ChEMBL
LigandPNGBDBM50253658(2-[4-[2-Amino-3-(4-fluoro-phenyl)-propionyl]-3-(2-...)
Affinity DataKi:  624nM. Assay description: Displacement of europium-labeled NDP-alpha-MSH from human MC4R expressed in HEK293 cells
In DepthDetails ArticlePubMed
TargetMelanocortin receptor 4(Homo sapiens (Human))
Procter & Gamble Pharmaceuticals
Curated by ChEMBL
LigandPNGBDBM50253658(2-[4-[2-Amino-3-(4-fluoro-phenyl)-propionyl]-3-(2-...)
Affinity DataEC50:  391nM. Assay description: Agonist activity at human MC4R expressed in HEK293 cells assessed as effect on CRE-driven luminescence by luciferase reporter gene assay
In DepthDetails ArticlePubMed